{"text_format":"1","workbook":"xlsx","n_sheets":4,"sheets":["Tool","Varianten","Drop_downs","Messungen"],"not_rendered":{"charts":4,"images":0,"macros":1,"external_links":0,"defined_names":0,"comments":0,"pivot_tables":0},"unopened":[],"bounds":{"document_bytes":16777216,"sheet_cells":100000,"rows_first":2000,"rows_last":500,"rows_between":2000,"halvings":0,"cell_chars":16384,"cell_head_chars":4096},"cells_cut":0,"cells_raw":0,"read":"whole","date_system":"1900"}

{"sheet":"Tool","index":0,"n_rows":121,"n_cols":28,"rows_kept":121,"cut":false,"hidden":false,"merged":[[0,5,0,27],[6,0,7,0]]}
[null,"Flächen-masse","Abstand","Fugen-anteil","Grundbauteil","Terzband-Mittenfrequenz in Hz"]
[null,"kg/m²","mm",1,null,50,63,80,100,125,160,200,250,315,400,500,630,800,1000,1250,1600,2000,2500,3150,4000,5000,null,"EZW"]
["Eingabewert",20,230,0.01,"Schalldämmmaß",29.718038816021384,28.2,37.9,40.9,42.4,36.6,38.4,40.299999999999997,41.2,42.8,46.8,48.4,47.3,46.1,40.5,42.4,45.1,48,52.3,55.5,58.1,null,{"$f":"einzahlwert($I$3:$X$3)","v":46}]
["Maximalwert",48,252,1.6299999999999999E-2]
["Minimalwert",3.4,215,0]
[null,{"$f":"IF(AND(B3<=B4,B3>=B5),\"\",\"FEHLER\")","v":""},{"$f":"IF(AND(C3<=C4,C3>=C5),\"\",\"FEHLER\")","v":""},{"$f":"IF(AND(D3<=D4,D3>=D5),\"\",\"FEHLER\")","v":""},"Verbesserungsmaß",{"$f":"F112+F114+F111+F113+F115","v":-6.0072920112118169},-4.0597382363122421,-3.9074405213634975,-1.855117831656397,1.803009748327387,4.8121615958902701,8.7819408538623343,13.372301885321605,13.397279824174264,13.591506865154491,13.712074944236761,12.337379891383581,12.648927669828041,12.578166826546415,9.8252376831865735,8.5762949418971601,8.4620821834735231,6.9930884257430135,7.298389518136208,8.2854744232681021,7.7991870612046146,null,{"$f":"AB7-AB3","v":10}]
[{"$f":"IF(COUNTIF(B6:D6,\"FEHLER\")>0,\"FEHLER IN EINGABE\",\"Eingabe in Ordnung\")","v":"Eingabe in Ordnung"},null,null,null,"Schalldämmmaß",{"$f":"F6+F3","v":23.710746804809567},24.140261763687757,33.992559478636501,39.044882168343605,44.203009748327389,41.412161595890268,47.181940853862329,53.672301885321602,54.597279824174265,56.39150686515449,60.512074944236758,60.737379891383583,59.948927669828038,58.678166826546416,50.325237683186572,50.976294941897159,53.562082183473521,54.993088425743011,59.598389518136202,63.785474423268099,65.899187061204614,null,{"$f":"einzahlwert(I7:X7)","v":56}]
[]
[null,null,null,"Grundbauteil auswahl:","SHB Ziegel",{"$f":"INDEX(Drop_downs!B3:B4,MATCH($E$9,Drop_downs!$A$3:$A$4,0))","v":29.718038816021384},{"$f":"INDEX(Drop_downs!C3:C4,MATCH($E$9,Drop_downs!$A$3:$A$4,0))","v":28.2},{"$f":"INDEX(Drop_downs!D3:D4,MATCH($E$9,Drop_downs!$A$3:$A$4,0))","v":37.9},{"$f":"INDEX(Drop_downs!E3:E4,MATCH($E$9,Drop_downs!$A$3:$A$4,0))","v":40.9},{"$f":"INDEX(Drop_downs!F3:F4,MATCH($E$9,Drop_downs!$A$3:$A$4,0))","v":42.4},{"$f":"INDEX(Drop_downs!G3:G4,MATCH($E$9,Drop_downs!$A$3:$A$4,0))","v":36.6},{"$f":"INDEX(Drop_downs!H3:H4,MATCH($E$9,Drop_downs!$A$3:$A$4,0))","v":38.4},{"$f":"INDEX(Drop_downs!I3:I4,MATCH($E$9,Drop_downs!$A$3:$A$4,0))","v":40.299999999999997},{"$f":"INDEX(Drop_downs!J3:J4,MATCH($E$9,Drop_downs!$A$3:$A$4,0))","v":41.2},{"$f":"INDEX(Drop_downs!K3:K4,MATCH($E$9,Drop_downs!$A$3:$A$4,0))","v":42.8},{"$f":"INDEX(Drop_downs!L3:L4,MATCH($E$9,Drop_downs!$A$3:$A$4,0))","v":46.8},{"$f":"INDEX(Drop_downs!M3:M4,MATCH($E$9,Drop_downs!$A$3:$A$4,0))","v":48.4},{"$f":"INDEX(Drop_downs!N3:N4,MATCH($E$9,Drop_downs!$A$3:$A$4,0))","v":47.3},{"$f":"INDEX(Drop_downs!O3:O4,MATCH($E$9,Drop_downs!$A$3:$A$4,0))","v":46.1},{"$f":"INDEX(Drop_downs!P3:P4,MATCH($E$9,Drop_downs!$A$3:$A$4,0))","v":40.5},{"$f":"INDEX(Drop_downs!Q3:Q4,MATCH($E$9,Drop_downs!$A$3:$A$4,0))","v":42.4},{"$f":"INDEX(Drop_downs!R3:R4,MATCH($E$9,Drop_downs!$A$3:$A$4,0))","v":45.1},{"$f":"INDEX(Drop_downs!S3:S4,MATCH($E$9,Drop_downs!$A$3:$A$4,0))","v":48},{"$f":"INDEX(Drop_downs!T3:T4,MATCH($E$9,Drop_downs!$A$3:$A$4,0))","v":52.3},{"$f":"INDEX(Drop_downs!U3:U4,MATCH($E$9,Drop_downs!$A$3:$A$4,0))","v":55.5},{"$f":"INDEX(Drop_downs!V3:V4,MATCH($E$9,Drop_downs!$A$3:$A$4,0))","v":58.1}]
[]
[]
[]
[]
[]
[]
[]
[]
[]
[]
[]
[]
[]
[]
[]
[]
[]
[]
[]
[]
[]
{"$rows_left_out":92}
{"sheet":"Varianten","index":1,"n_rows":60,"n_cols":24,"rows_kept":60,"cut":false,"hidden":true,"merged":[]}
[null,50,63,80,100,125,160,200,250,315,400,500,630,800,1000,1250,1600,2000,2500,3150,4000,5000,null,"EZW"]
["Verbesserungsmaß - Rechnung",{"$f":"B55+B57+B54+B56+B58","v":-2.9799021633089211},4.9832098266990101,4.8235986653370304,1.7126194467586373,4.7320078863530277,4.2194360002811333,11.16865840314405,14.932957531578861,14.851049658993301,14.999135341918004,16.229145788961752,14.984169282443432,15.521633925360021,16.238708846891463,12.016457722453302,10.910469383811538,11.360664695072977,7.8885775779808389,9.92820041300428,11.313769224186771,9.0630417207270035,null,{"$f":"X4-einzahlwert($E$52:$T$52)","v":12}]
["Verbesserungsmaß - Messung",{"$f":"INDEX(Messungen!AH5:AH46,$A$42)","v":-3.7999999999999972},{"$f":"INDEX(Messungen!AI5:AI46,$A$42)","v":2.2000000000000028},{"$f":"INDEX(Messungen!AJ5:AJ46,$A$42)","v":2.1000000000000014},{"$f":"INDEX(Messungen!AK5:AK46,$A$42)","v":1.6999999999999957},{"$f":"INDEX(Messungen!AL5:AL46,$A$42)","v":8.3999999999999986},{"$f":"INDEX(Messungen!AM5:AM46,$A$42)","v":7.2999999999999972},{"$f":"INDEX(Messungen!AN5:AN46,$A$42)","v":13.200000000000003},{"$f":"INDEX(Messungen!AO5:AO46,$A$42)","v":13.700000000000003},{"$f":"INDEX(Messungen!AP5:AP46,$A$42)","v":13.299999999999997},{"$f":"INDEX(Messungen!AQ5:AQ46,$A$42)","v":13.5},{"$f":"INDEX(Messungen!AR5:AR46,$A$42)","v":14.300000000000004},{"$f":"INDEX(Messungen!AS5:AS46,$A$42)","v":13.5},{"$f":"INDEX(Messungen!AT5:AT46,$A$42)","v":15.5},{"$f":"INDEX(Messungen!AU5:AU46,$A$42)","v":17.100000000000001},{"$f":"INDEX(Messungen!AV5:AV46,$A$42)","v":14.299999999999997},{"$f":"INDEX(Messungen!AW5:AW46,$A$42)","v":12.900000000000006},{"$f":"INDEX(Messungen!AX5:AX46,$A$42)","v":13},{"$f":"INDEX(Messungen!AY5:AY46,$A$42)","v":8.2999999999999972},{"$f":"INDEX(Messungen!AZ5:AZ46,$A$42)","v":10.399999999999991},{"$f":"INDEX(Messungen!BA5:BA46,$A$42)","v":12.5},{"$f":"INDEX(Messungen!BB5:BB46,$A$42)","v":9.2999999999999972},null,{"$f":"X5-einzahlwert($E$52:$T$52)","v":12}]
["Schalldämmmaß - Rechnung",{"$f":"B2+B52","v":37.820097836691076},{"$f":"C2+C52","v":34.383209826699009},32.523598665337033,49.812619446758639,46.432007886353034,55.319436000281137,58.16865840314405,67.432957531578865,69.351049658993304,73.499135341918006,73.829145788961753,75.984169282443432,77.721633925360024,79.838708846891464,77.416457722453302,79.51046938381154,79.460664695072978,79.188577577980837,80.128200413004279,83.613769224186768,82.263041720727003,null,{"$f":"einzahlwert(E4:T4)","v":74}]
["Schalldämmmaß - Messung",{"$f":"B3+B52","v":37},{"$f":"C3+C52","v":31.6},29.8,49.8,50.1,58.4,60.2,66.2,67.8,72,71.900000000000006,74.5,77.7,80.7,79.7,81.5,81.099999999999994,79.599999999999994,80.599999999999994,84.8,82.5,null,{"$f":"einzahlwert(E5:T5)","v":74}]
[]
[]
["Variantennummer aus Dropdown auswählen"]
[38490058]
[]
[]
[]
[]
[]
[]
[]
[]
[]
[]
[]
[]
[]
[]
[]
[]
[]
[]
[]
[]
["Blattschutz-Kennwort: \"shb\""]
{"$rows_left_out":31}
{"sheet":"Drop_downs","index":2,"n_rows":4,"n_cols":22,"rows_kept":4,"cut":false,"hidden":true,"merged":[]}
[null,50,63,80,100,125,160,200,250,315,400,500,630,800,1000,1250,1600,2000,2500,3150,4000,5000]
["Grundwand auswählen"]
["SHB Beton",45.9,37.6,39,50.2,47.1,49.7,48.4,52.2,54.8,58.4,58.7,62.8,62.6,64.8,66.2,69.2,70.2,71.2,73.5,77,79.099999999999994]
["SHB Ziegel",29.718038816021384,28.2,37.9,40.9,42.4,36.6,38.4,40.299999999999997,41.2,42.8,46.8,48.4,47.3,46.1,40.5,42.4,45.1,48,52.3,55.5,58.1]

{"sheet":"Messungen","index":3,"n_rows":46,"n_cols":55,"rows_kept":46,"cut":false,"hidden":true,"merged":[]}
[]
[null,null,null,null,null,"Schalldämmmaß_Grundbauteil",null,null,null,null,null,null,null,null,null,null,null,null,null,null,null,null,null,null,null,null,null,null,null,null,null,null,null,"Lösungsvektor y: Verbesserungsmaß",null,null,null,null,null,null,null,null,null,null,null,null,null,null,null,null,null,null,null,null,"Vorhersage_Verbesserungsmaß"]
[null,null,null,null,null,"dB",null,null,null,null,null,null,null,null,null,null,null,null,null,null,null,null,null,null,null,null,null,null,"Flächenmasse","Abstand","Fugenanteil",null,null,"dB"]
["Variantennummer","Zeile","Grundbauteilnummer","Zeile",null,50,63,80,100,125,160,200,250,315,400,500,630,800,1000,1250,1600,2000,2500,3150,4000,5000,"EZW_Grundbauteil","EZW_Konstruktion","kg/m2","m",1,null,null,50,63,80,100,125,160,200,250,315,400,500,630,800,1000,1250,1600,2000,2500,3150,4000,5000,"EZW"]
[38490055,5,38490053,3,null,40.799999999999997,29.4,27.7,48.1,41.7,51.1,47,52.5,54.5,58.5,57.6,61,62.2,63.6,65.400000000000006,68.599999999999994,68.099999999999994,71.3,70.2,72.3,73.2,62,73,15,245,7.0000000000000001E-3,null,null,-0.69999999999999574,4.1000000000000014,6.1999999999999993,1.3999999999999986,5.8999999999999986,3,8.7999999999999972,15.700000000000003,13.900000000000006,15.599999999999994,16.300000000000004,15.299999999999997,16.200000000000003,17.100000000000001,13.299999999999997,10.600000000000009,10.800000000000011,7.2000000000000028,9.2999999999999972,12.200000000000003,10.099999999999994,11]
[38490056,6,38490053,3,null,40.799999999999997,29.4,27.7,48.1,41.7,51.1,47,52.5,54.5,58.5,57.6,61,62.2,63.6,65.400000000000006,68.599999999999994,68.099999999999994,71.3,70.2,72.3,73.2,62,76,15,245,0,null,null,3.8000000000000043,15.5,9.0000000000000036,4.1000000000000014,5.8999999999999986,7.5,16.700000000000003,19.599999999999994,18.799999999999997,18.099999999999994,18.499999999999993,16.900000000000006,17.899999999999991,18.999999999999993,15.699999999999989,14.100000000000009,12.800000000000011,7.4000000000000057,9.3999999999999915,13.400000000000006,10.299999999999997,14]
[38490057,7,38490053,3,null,40.799999999999997,29.4,27.7,48.1,41.7,51.1,47,52.5,54.5,58.5,57.6,61,62.2,63.6,65.400000000000006,68.599999999999994,68.099999999999994,71.3,70.2,72.3,73.2,62,75,15,245,0,null,null,-2.5,5.7000000000000028,7.5000000000000036,4.3999999999999986,8.8999999999999986,5.6999999999999957,12,15.5,14.200000000000003,15,16.300000000000004,15,16.399999999999991,17.800000000000004,14.899999999999991,12.700000000000003,11.200000000000003,6.6000000000000085,9.2999999999999972,12.400000000000006,9.7999999999999972,13]
[38490058,8,38490053,3,null,40.799999999999997,29.4,27.7,48.1,41.7,51.1,47,52.5,54.5,58.5,57.6,61,62.2,63.6,65.400000000000006,68.599999999999994,68.099999999999994,71.3,70.2,72.3,73.2,62,74,15,245,7.0000000000000001E-3,null,null,-3.7999999999999972,2.2000000000000028,2.1000000000000014,1.6999999999999957,8.3999999999999986,7.2999999999999972,13.200000000000003,13.700000000000003,13.299999999999997,13.5,14.300000000000004,13.5,15.5,17.100000000000001,14.299999999999997,12.900000000000006,13,8.2999999999999972,10.399999999999991,12.5,9.2999999999999972,12]
[38490059,9,38490053,3,null,40.799999999999997,29.4,27.7,48.1,41.7,51.1,47,52.5,54.5,58.5,57.6,61,62.2,63.6,65.400000000000006,68.599999999999994,68.099999999999994,71.3,70.2,72.3,73.2,62,76,15,245,0,null,null,-0.59999999999999432,14.399999999999999,8.5000000000000036,0.60000000000000142,1,10.600000000000001,18.599999999999994,20.700000000000003,18.599999999999994,18.200000000000003,19.600000000000001,17.900000000000006,17.799999999999997,18.800000000000004,17.699999999999989,15.300000000000011,14.600000000000009,8.7999999999999972,10.5,13.400000000000006,9.2999999999999972,14]
[38490060,10,38490053,3,null,40.799999999999997,29.4,27.7,48.1,41.7,51.1,47,52.5,54.5,58.5,57.6,61,62.2,63.6,65.400000000000006,68.599999999999994,68.099999999999994,71.3,70.2,72.3,73.2,62,74,15,245,7.0000000000000001E-3,null,null,-1.6999999999999957,4.3999999999999986,7.0999999999999979,2.5,7.8999999999999986,5.1999999999999957,11.200000000000003,14.599999999999994,13.200000000000003,14.200000000000003,15.499999999999993,14.900000000000006,15.200000000000003,17.100000000000001,14.299999999999997,12.300000000000011,12.800000000000011,8,9.7000000000000028,12.600000000000009,10.099999999999994,12]
[38490061,11,38490053,3,null,40.799999999999997,29.4,27.7,48.1,41.7,51.1,47,52.5,54.5,58.5,57.6,61,62.2,63.6,65.400000000000006,68.599999999999994,68.099999999999994,71.3,70.2,72.3,73.2,62,76,15,245,0,null,null,-3.5,12.200000000000003,10.000000000000004,4.1999999999999957,7.6999999999999957,4.7999999999999972,13.600000000000001,18.299999999999997,18.099999999999994,16.200000000000003,17.899999999999999,16.099999999999994,16.899999999999991,17.800000000000004,14.899999999999991,13.200000000000003,14.400000000000006,8.7000000000000028,10.399999999999991,13.200000000000003,9.8999999999999915,14]
[38490062,12,38490053,3,null,40.799999999999997,29.4,27.7,48.1,41.7,51.1,47,52.5,54.5,58.5,57.6,61,62.2,63.6,65.400000000000006,68.599999999999994,68.099999999999994,71.3,70.2,72.3,73.2,62,77,15,245,0,null,null,0.60000000000000142,15.399999999999999,10.000000000000004,6.8999999999999986,11,7.3999999999999986,16.600000000000001,19.599999999999994,18,16.900000000000006,18.100000000000001,16.400000000000006,17.799999999999997,18.600000000000001,15.5,14.300000000000011,14.200000000000003,8.5,10.099999999999994,13.100000000000009,9.7999999999999972,15]
[38490063,13,38490053,3,null,40.799999999999997,29.4,27.7,48.1,41.7,51.1,47,52.5,54.5,58.5,57.6,61,62.2,63.6,65.400000000000006,68.599999999999994,68.099999999999994,71.3,70.2,72.3,73.2,62,75,15,245,0,null,null,-0.79999999999999716,9.2000000000000028,6.4000000000000021,4.6999999999999957,10.099999999999994,6.1999999999999957,12.600000000000001,15.200000000000003,14.099999999999994,14.099999999999994,15.999999999999993,15.900000000000006,15.899999999999991,17.999999999999993,14.5,12.900000000000006,12.600000000000009,7.7000000000000028,9.5,12.400000000000006,9.2999999999999972,13]
[38490064,14,38490053,3,null,40.799999999999997,29.4,27.7,48.1,41.7,51.1,47,52.5,54.5,58.5,57.6,61,62.2,63.6,65.400000000000006,68.599999999999994,68.099999999999994,71.3,70.2,72.3,73.2,62,73,7.5,245,7.0000000000000001E-3,null,null,-1.3999999999999986,5.3999999999999986,7.1999999999999993,4,6,4.5,9.5,12.799999999999997,12.700000000000003,13.099999999999994,15.100000000000001,14.900000000000006,15.399999999999991,15.699999999999996,9,10,11,9.7000000000000028,13.799999999999997,12.100000000000009,9.2999999999999972,11]
[38490065,15,38490053,3,null,40.799999999999997,29.4,27.7,48.1,41.7,51.1,47,52.5,54.5,58.5,57.6,61,62.2,63.6,65.400000000000006,68.599999999999994,68.099999999999994,71.3,70.2,72.3,73.2,62,74,7.5,245,7.0000000000000001E-3,null,null,-3.8999999999999986,11.399999999999999,11.900000000000002,7.2999999999999972,5.2999999999999972,2.7999999999999972,12.100000000000001,14.5,14.799999999999997,14.599999999999994,16.899999999999999,15.900000000000006,16.599999999999994,15.899999999999999,9.3999999999999915,10.300000000000011,11.800000000000011,10.400000000000006,14.5,12.5,9,12]
[38490066,16,38490053,3,null,40.799999999999997,29.4,27.7,48.1,41.7,51.1,47,52.5,54.5,58.5,57.6,61,62.2,63.6,65.400000000000006,68.599999999999994,68.099999999999994,71.3,70.2,72.3,73.2,62,75,7.5,245,0,null,null,-3.7999999999999972,13.5,10.7,8.2999999999999972,7.2999999999999972,4.6999999999999957,12.799999999999997,15.599999999999994,14.900000000000006,15.799999999999997,17.699999999999996,15.299999999999997,16.200000000000003,16.300000000000004,10.799999999999997,10.800000000000011,11.300000000000011,10.100000000000009,14.200000000000003,12.5,8.8999999999999915,13]
[38490067,17,38490053,3,null,40.799999999999997,29.4,27.7,48.1,41.7,51.1,47,52.5,54.5,58.5,57.6,61,62.2,63.6,65.400000000000006,68.599999999999994,68.099999999999994,71.3,70.2,72.3,73.2,62,73,7.5,245,0,null,null,-1.7999999999999972,7.3999999999999986,6.0999999999999979,4.6999999999999957,6.1999999999999957,4.2999999999999972,10.600000000000001,13.5,13.400000000000006,12.799999999999997,15.300000000000004,14.599999999999994,15.599999999999994,15.999999999999993,10,10.100000000000009,10.700000000000003,9.2999999999999972,13.599999999999994,12,8.5999999999999943,11]
[38490068,18,38490053,3,null,40.799999999999997,29.4,27.7,48.1,41.7,51.1,47,52.5,54.5,58.5,57.6,61,62.2,63.6,65.400000000000006,68.599999999999994,68.099999999999994,71.3,70.2,72.3,73.2,62,72,48,245,7.0000000000000001E-3,null,null,-3.0999999999999943,3.5,4.6999999999999993,2.2999999999999972,6.0999999999999943,5.5,11.700000000000003,15.799999999999997,18,15.599999999999994,16.499999999999993,16.400000000000006,13.299999999999997,10.899999999999999,7.7999999999999972,4.6000000000000085,7,3.1000000000000085,6.3999999999999915,9.2999999999999972,9.3999999999999915,10]
[38490069,19,38490053,3,null,40.799999999999997,29.4,27.7,48.1,41.7,51.1,47,52.5,54.5,58.5,57.6,61,62.2,63.6,65.400000000000006,68.599999999999994,68.099999999999994,71.3,70.2,72.3,73.2,62,73,48,245,7.0000000000000001E-3,null,null,-3.3999999999999986,5.2000000000000028,3.4000000000000021,2.6999999999999957,6.5,7.7999999999999972,14.100000000000001,18.5,21,16,18.100000000000001,17,14,11.800000000000004,8.2999999999999972,4.8000000000000114,7.5,4.1000000000000085,7.2000000000000028,10,9.5,11]
[38490070,20,38490053,3,null,40.799999999999997,29.4,27.7,48.1,41.7,51.1,47,52.5,54.5,58.5,57.6,61,62.2,63.6,65.400000000000006,68.599999999999994,68.099999999999994,71.3,70.2,72.3,73.2,62,77,48,245,0,null,null,4.4000000000000057,14.600000000000001,11.500000000000004,11.100000000000001,14.099999999999994,15.199999999999996,18.5,19.099999999999994,20.099999999999994,16.099999999999994,17.199999999999996,18,19,12.999999999999993,12,6.9000000000000057,11,8.6000000000000085,12.399999999999991,15.100000000000009,10.599999999999994,15]
[38490071,21,38490053,3,null,40.799999999999997,29.4,27.7,48.1,41.7,51.1,47,52.5,54.5,58.5,57.6,61,62.2,63.6,65.400000000000006,68.599999999999994,68.099999999999994,71.3,70.2,72.3,73.2,62,75,48,245,0,null,null,-1.0999999999999943,10.200000000000003,7.8000000000000007,6.8999999999999986,11.399999999999999,11.899999999999999,16.200000000000003,17.099999999999994,17.200000000000003,15.400000000000006,16.399999999999999,16.5,15.799999999999997,11.999999999999993,10.5,6.3000000000000114,9.3000000000000114,5.9000000000000057,10,12.900000000000006,9.3999999999999915,13]
[38490031,24,38490029,23,null,45.9,37.6,39,50.2,47.1,49.7,48.4,52.2,54.8,58.4,58.7,62.8,62.6,64.8,66.2,69.2,70.2,71.2,73.5,77,79.099999999999994,63,70,3.4,215,0,null,null,-9.6000000000000014,-13.100000000000001,-9.6000000000000014,-4.5,3.1000000000000014,3,8.6000000000000014,12,11,11.500000000000007,10,5.6000000000000085,7.3999999999999986,7.5,8.5999999999999943,6.2000000000000028,5.7999999999999972,5.7999999999999972,5.2000000000000028,4.2000000000000028,5.4000000000000057,7]
[38490032,25,38490029,23,null,45.9,37.6,39,50.2,47.1,49.7,48.4,52.2,54.8,58.4,58.7,62.8,62.6,64.8,66.2,69.2,70.2,71.2,73.5,77,79.099999999999994,63,71,3.4,215,0,null,null,-8.3999999999999986,-11.900000000000002,-7.1000000000000014,-3.5,2.1000000000000014,5.0999999999999943,8.7000000000000028,12.599999999999994,10.700000000000003,12.100000000000001,10.299999999999997,6.9000000000000057,8.4999999999999929,9.2000000000000028,9.2999999999999972,7.2999999999999972,7.2999999999999972,7.0999999999999943,7.4000000000000057,7.2000000000000028,6.3000000000000114,8]
[38490033,26,38490029,23,null,45.9,37.6,39,50.2,47.1,49.7,48.4,52.2,54.8,58.4,58.7,62.8,62.6,64.8,66.2,69.2,70.2,71.2,73.5,77,79.099999999999994,63,69,5.8,215,0,null,null,-7,-9.2000000000000028,-11.600000000000001,-3.6000000000000014,3.8999999999999986,8.8999999999999986,7.5,11.799999999999997,9.9000000000000057,7.6999999999999957,8.3999999999999915,7,9.3000000000000043,8.9000000000000057,5.0999999999999943,1,-0.5,-0.60000000000000853,9.9999999999994316E-2,0.29999999999999716,3.5,6]
[38490034,27,38490029,23,null,45.9,37.6,39,50.2,47.1,49.7,48.4,52.2,54.8,58.4,58.7,62.8,62.6,64.8,66.2,69.2,70.2,71.2,73.5,77,79.099999999999994,63,70,5.8,215,0,null,null,-7.3999999999999986,-9.7000000000000028,-12.399999999999999,-1.3000000000000043,3.6000000000000014,7.7999999999999972,7,11.399999999999999,9.1000000000000014,7.0000000000000071,8.0999999999999943,6.6000000000000085,8.8999999999999986,8.7000000000000028,5.3999999999999915,1.7999999999999972,0.59999999999999432,1.0999999999999943,1.7999999999999972,3.4000000000000057,4.8000000000000114,7]
[38490035,28,38490029,23,null,45.9,37.6,39,50.2,47.1,49.7,48.4,52.2,54.8,58.4,58.7,62.8,62.6,64.8,66.2,69.2,70.2,71.2,73.5,77,79.099999999999994,63,72,7.5,215,6.0000000000000001E-3,null,null,-7.1999999999999957,-8,-9.8999999999999986,-2.5,-1.1000000000000014,5.3999999999999986,7.7000000000000028,14.099999999999994,11.799999999999997,12.399999999999999,12.299999999999997,10.799999999999997,12.399999999999999,12,10.700000000000003,9.8999999999999915,10.599999999999994,12.399999999999991,11.599999999999994,8.5999999999999943,8,9]
[38490036,29,38490029,23,null,45.9,37.6,39,50.2,47.1,49.7,48.4,52.2,54.8,58.4,58.7,62.8,62.6,64.8,66.2,69.2,70.2,71.2,73.5,77,79.099999999999994,63,74,7.5,215,0,null,null,-7.6999999999999957,2.6999999999999957,-1.2999999999999972,0.89999999999999858,1.5,8.5,9.8999999999999986,15.299999999999997,13.200000000000003,12.500000000000007,12.299999999999997,10.799999999999997,12.999999999999993,13,12,11.799999999999997,12.299999999999997,13.200000000000003,12.5,9.0999999999999943,8.3000000000000114,11]
[38490037,30,38490029,23,null,45.9,37.6,39,50.2,47.1,49.7,48.4,52.2,54.8,58.4,58.7,62.8,62.6,64.8,66.2,69.2,70.2,71.2,73.5,77,79.099999999999994,63,73,7.5,215,0,null,null,-4.6999999999999957,-1.1000000000000014,-4.2999999999999972,2.1999999999999957,-0.10000000000000142,8.0999999999999943,10.899999999999999,14.899999999999991,11.900000000000006,12.699999999999996,12.099999999999994,10.900000000000006,11.899999999999999,11.100000000000009,11.200000000000003,11,10.799999999999997,12.399999999999991,11.900000000000006,8.7999999999999972,8.2000000000000028,10]
[38490038,31,38490029,23,null,45.9,37.6,39,50.2,47.1,49.7,48.4,52.2,54.8,58.4,58.7,62.8,62.6,64.8,66.2,69.2,70.2,71.2,73.5,77,79.099999999999994,63,72,7.5,215,0,null,null,-6.8999999999999986,-5.3000000000000043,-8,-0.70000000000000284,-0.30000000000000426,6.1999999999999957,8.3999999999999986,14,11.200000000000003,11.399999999999999,11.599999999999994,10.600000000000009,10.800000000000004,11.100000000000009,10.200000000000003,9.5,10,11.899999999999991,11.5,8.7000000000000028,8.2000000000000028,9]
[38490039,32,38490029,23,null,45.9,37.6,39,50.2,47.1,49.7,48.4,52.2,54.8,58.4,58.7,62.8,62.6,64.8,66.2,69.2,70.2,71.2,73.5,77,79.099999999999994,63,73,7.5,215,0,null,null,-6.2999999999999972,-5.6000000000000014,-7,2.5,4.6999999999999957,7.6999999999999957,9.5,15.099999999999994,10.299999999999997,9.8999999999999986,10.299999999999997,10.100000000000009,11.699999999999996,10.600000000000009,9,7.2999999999999972,7.7000000000000028,8.2000000000000028,10.200000000000003,9.2000000000000028,9,10]
{"$rows_left_out":16}