{"text_format":"1","workbook":"xlsx","n_sheets":4,"sheets":["Tool","Varianten","Messungen","Drop_downs"],"not_rendered":{"charts":4,"images":0,"macros":1,"external_links":0,"defined_names":0,"comments":0,"pivot_tables":0},"unopened":[],"bounds":{"document_bytes":16777216,"sheet_cells":100000,"rows_first":2000,"rows_last":500,"rows_between":2000,"halvings":0,"cell_chars":16384,"cell_head_chars":4096},"cells_cut":0,"cells_raw":0,"read":"whole","date_system":"1900"}

{"sheet":"Tool","index":0,"n_rows":121,"n_cols":27,"rows_kept":121,"cut":false,"hidden":false,"merged":[[0,4,0,26],[5,0,6,0]]}
[null,"Dämmung","Putz","Grundbauteil","Terzband-Mittenfrequenz in Hz"]
[null,"Dynamische Steifigkeit in MN/m³","Putzmasse in kg/m²",null,50,63,80,100,125,160,200,250,315,400,500,630,800,1000,1250,1600,2000,2500,3150,4000,5000,null,"EZW"]
["Eingabewert",50,18,"Schalldämmmaß",45.9,37.6,39,50.2,47.1,49.7,48.4,52.2,54.8,58.4,58.7,62.8,62.6,64.8,66.2,69.2,70.2,71.2,73.5,77,79.099999999999994,null,{"$f":"einzahlwert($H$3:$W$3)","v":63}]
["Maximalwert",61,18.600000000000001,"Maximalwert",45.9,37.6,39,50.2,47.1,49.7,48.4,52.2,54.8,58.4,58.7,62.8,62.6,64.8,66.2,69.2,70.2,71.2,73.5,77,79.099999999999994]
["Minimalwert",8,4.2,"Minimalwert",29.718038816021384,28.2,37.9,40.9,42.4,36.6,38.4,40.299999999999997,41.2,42.8,46.8,48.4,47.3,46.1,40.5,42.4,45.1,48,52.3,55.5,58.1]
["Resonanz-frequenz in Hz",null,null,"Verbesserungsmaß",{"$f":"E112+E114+E111+E113+E115","v":-9.8860989354296169},-6.6034823300964796,3.9726514424930666,-6.0172786933217512,-3.1871903856792292,-4.1264278267591452,-3.5689148274915903,-6.557203902166032,-2.4460787593323641,1.7694290000176061,6.3287288864497668,7.4445923437710277,13.463900266002572,14.383347525144419,13.777665048288299,12.450180455292973,11.972464447057948,11.252719094113873,10.319918428331842,9.9875724788079552,11.454991723921953,null,{"$f":"AA7-AA3","v":-1}]
[null,{"$f":"160*SQRT(B3/C3)","v":266.66666666666669},null,"Gesamtkonstruktion",{"$f":"E6+E3","v":36.013901064570383},30.996517669903522,42.972651442493067,44.182721306678253,43.912809614320771,45.573572173240855,44.831085172508409,45.642796097833973,52.353921240667631,60.169429000017601,65.02872888644977,70.244592343771018,76.063900266002577,79.183347525144413,79.977665048288301,81.650180455292968,82.172464447057948,82.452719094113874,83.819918428331846,86.987572478807948,90.554991723921944,null,{"$f":"einzahlwert(H7:W7)","v":62}]
[null,{"$f":"IF(AND(B3<=B4,B3>=B5),\"\",\"FEHLER\")","v":""},{"$f":"IF(AND(C3<=C4,C3>=C5),\"\",\"FEHLER\")","v":""},null,{"$f":"IF(AND(E3<=E4,E3>=E5),\"\",\"FEHLER\")","v":""},"","","","","","","","","","","","","","","","","","","",""]
[null,null,"Grundbauteil auswahl:","SHB Beton",{"$f":"INDEX(Drop_downs!B3:B4,MATCH(Tool!$D$9,Drop_downs!$A$3:$A$4,0))","v":45.9},{"$f":"INDEX(Drop_downs!C3:C4,MATCH(Tool!$D$9,Drop_downs!$A$3:$A$4,0))","v":37.6},{"$f":"INDEX(Drop_downs!D3:D4,MATCH(Tool!$D$9,Drop_downs!$A$3:$A$4,0))","v":39},{"$f":"INDEX(Drop_downs!E3:E4,MATCH(Tool!$D$9,Drop_downs!$A$3:$A$4,0))","v":50.2},{"$f":"INDEX(Drop_downs!F3:F4,MATCH(Tool!$D$9,Drop_downs!$A$3:$A$4,0))","v":47.1},{"$f":"INDEX(Drop_downs!G3:G4,MATCH(Tool!$D$9,Drop_downs!$A$3:$A$4,0))","v":49.7},{"$f":"INDEX(Drop_downs!H3:H4,MATCH(Tool!$D$9,Drop_downs!$A$3:$A$4,0))","v":48.4},{"$f":"INDEX(Drop_downs!I3:I4,MATCH(Tool!$D$9,Drop_downs!$A$3:$A$4,0))","v":52.2},{"$f":"INDEX(Drop_downs!J3:J4,MATCH(Tool!$D$9,Drop_downs!$A$3:$A$4,0))","v":54.8},{"$f":"INDEX(Drop_downs!K3:K4,MATCH(Tool!$D$9,Drop_downs!$A$3:$A$4,0))","v":58.4},{"$f":"INDEX(Drop_downs!L3:L4,MATCH(Tool!$D$9,Drop_downs!$A$3:$A$4,0))","v":58.7},{"$f":"INDEX(Drop_downs!M3:M4,MATCH(Tool!$D$9,Drop_downs!$A$3:$A$4,0))","v":62.8},{"$f":"INDEX(Drop_downs!N3:N4,MATCH(Tool!$D$9,Drop_downs!$A$3:$A$4,0))","v":62.6},{"$f":"INDEX(Drop_downs!O3:O4,MATCH(Tool!$D$9,Drop_downs!$A$3:$A$4,0))","v":64.8},{"$f":"INDEX(Drop_downs!P3:P4,MATCH(Tool!$D$9,Drop_downs!$A$3:$A$4,0))","v":66.2},{"$f":"INDEX(Drop_downs!Q3:Q4,MATCH(Tool!$D$9,Drop_downs!$A$3:$A$4,0))","v":69.2},{"$f":"INDEX(Drop_downs!R3:R4,MATCH(Tool!$D$9,Drop_downs!$A$3:$A$4,0))","v":70.2},{"$f":"INDEX(Drop_downs!S3:S4,MATCH(Tool!$D$9,Drop_downs!$A$3:$A$4,0))","v":71.2},{"$f":"INDEX(Drop_downs!T3:T4,MATCH(Tool!$D$9,Drop_downs!$A$3:$A$4,0))","v":73.5},{"$f":"INDEX(Drop_downs!U3:U4,MATCH(Tool!$D$9,Drop_downs!$A$3:$A$4,0))","v":77},{"$f":"INDEX(Drop_downs!V3:V4,MATCH(Tool!$D$9,Drop_downs!$A$3:$A$4,0))","v":79.099999999999994}]
[{"$f":"IF(COUNTIF(B8:Y8,\"FEHLER\")>0,\"FEHLER IN EINGABE\",\"Eingabe in Ordnung\")","v":"Eingabe in Ordnung"}]
[]
[]
[]
[]
[]
[]
[]
[]
[]
[]
{"$rows_left_out":102}
{"sheet":"Varianten","index":1,"n_rows":60,"n_cols":24,"rows_kept":60,"cut":false,"hidden":true,"merged":[]}
[null,50,63,80,100,125,160,200,250,315,400,500,630,800,1000,1250,1600,2000,2500,3150,4000,5000,null,"EZW"]
["Verbesserungsmaß - Rechnung",{"$f":"B55+B57+B54+B56+B58","v":2.3366346130662423},-0.12216390168057467,-1.9871390894195551,-3.2882116932408851,-1.4033604546745078,0.32768425424141023,-3.2737453726852808,-4.5708429433490219,-6.8415299370344016,-9.6801446699908809,-8.1712845294952743,-0.25595185525864217,5.2094560721062981,9.0118511860101496,13.8425142954208,14.790071063117024,14.726109859257965,14.917619730549415,15.770512418384781,17.340302320688391,15.73849990883215,null,{"$f":"X4-einzahlwert($E$52:$T$52)","v":0}]
["Verbesserungsmaß - Messung",{"$f":"INDEX(Messungen!BF5:BF50,$A$42)","v":1.8850209008422425},{"$f":"INDEX(Messungen!BG5:BG50,$A$42)","v":-0.30000000000000071},{"$f":"INDEX(Messungen!BH5:BH50,$A$42)","v":-2.3999999999999986},{"$f":"INDEX(Messungen!BI5:BI50,$A$42)","v":-4.2999999999999972},{"$f":"INDEX(Messungen!BJ5:BJ50,$A$42)","v":-0.79999999999999716},{"$f":"INDEX(Messungen!BK5:BK50,$A$42)","v":1.7999999999999972},{"$f":"INDEX(Messungen!BL5:BL50,$A$42)","v":-2.5},{"$f":"INDEX(Messungen!BM5:BM50,$A$42)","v":-3.8999999999999986},{"$f":"INDEX(Messungen!BN5:BN50,$A$42)","v":-6.4000000000000057},{"$f":"INDEX(Messungen!BO5:BO50,$A$42)","v":-9.7999999999999972},{"$f":"INDEX(Messungen!BP5:BP50,$A$42)","v":-7.7999999999999972},{"$f":"INDEX(Messungen!BQ5:BQ50,$A$42)","v":-0.39999999999999858},{"$f":"INDEX(Messungen!BR5:BR50,$A$42)","v":5.6000000000000014},{"$f":"INDEX(Messungen!BS5:BS50,$A$42)","v":10.100000000000001},{"$f":"INDEX(Messungen!BT5:BT50,$A$42)","v":14.899999999999999},{"$f":"INDEX(Messungen!BU5:BU50,$A$42)","v":15.5},{"$f":"INDEX(Messungen!BV5:BV50,$A$42)","v":15.699999999999996},{"$f":"INDEX(Messungen!BW5:BW50,$A$42)","v":16.299999999999997},{"$f":"INDEX(Messungen!BX5:BX50,$A$42)","v":17.299999999999997},{"$f":"INDEX(Messungen!BY5:BY50,$A$42)","v":18.604277999836711},{"$f":"INDEX(Messungen!BZ5:BZ50,$A$42)","v":14.061453616618813},null,{"$f":"X5-einzahlwert($E$52:$T$52)","v":0}]
["Schalldämmmaß - Rechnung",{"$f":"B2+B52","v":32.054673429087629},{"$f":"C2+C52","v":28.077836098319423},35.912860910580441,37.611788306759117,40.996639545325493,36.927684254241413,35.126254627314715,35.729157056650976,34.358470062965601,33.119855330009116,38.628715470504723,48.144048144741355,52.509456072106296,55.111851186010149,54.342514295420798,57.190071063117024,59.826109859257969,62.917619730549418,68.07051241838478,72.840302320688394,73.838499908832148,null,{"$f":"einzahlwert(E4:T4)","v":46}]
["Schalldämmmaß - Messung",{"$f":"B3+B52","v":31.603059716863626},{"$f":"C3+C52","v":27.9},35.5,36.6,41.6,38.4,35.9,36.4,34.799999999999997,33,39,48,52.9,56.2,55.4,57.9,60.8,64.3,69.599999999999994,74.104277999836711,72.161453616618815,null,{"$f":"einzahlwert(E5:T5)","v":46}]
[]
[]
["Variantennummer aus Dropdown auswählen"]
[38490314]
[]
[]
[]
[]
[]
[]
[]
[]
[]
[]
[]
{"$rows_left_out":41}
{"sheet":"Messungen","index":2,"n_rows":50,"n_cols":79,"rows_kept":50,"cut":false,"hidden":true,"merged":[]}
[]
[null,null,null,null,null,"Schalldämmmaß_Grundbauteil",null,null,null,null,null,null,null,null,null,null,null,null,null,null,null,null,null,null,null,null,null,null,null,null,null,null,null,null,null,null,"10- abs(Abstand zu Resonanzfrequenz)",null,null,null,null,null,null,null,null,null,null,null,null,null,null,null,null,null,null,null,null,"Lösungsvektor y: Verbesserungsmaß",null,null,null,null,null,null,null,null,null,null,null,null,null,null,null,null,null,null,null,null,"Vorhersage_Verbesserungsmaß"]
[null,null,null,null,null,"dB",null,null,null,null,null,null,null,null,null,null,null,null,null,null,null,null,null,null,null,null,null,null,"Dynamische Steifigkeit des Dämmstoffes","Putzdicke","Putzdichte","Putzmasse","Anzahl der Dübel",null,null,null,"in TB",null,null,null,null,null,null,null,null,null,null,null,null,null,null,null,null,null,null,null,null,"dB"]
["Variantennummer","Zeile","Grundbauteilnummer","Zeile",null,50,63,80,100,125,160,200,250,315,400,500,630,800,1000,1250,1600,2000,2500,3150,4000,5000,"EZW_Grundbauteil","EZW_Konstruktion","MN/m3","m","kg/m3","gm/m2",1,"Messung bei Resonanzeinbruch","Resonanzeinbruch in TB","Berechnete Resonanzfrequenz",50,63,80,100,125,160,200,250,315,400,500,630,800,1000,1250,1600,2000,2500,3150,4000,5000,50,63,80,100,125,160,200,250,315,400,500,630,800,1000,1250,1600,2000,2500,3150,4000,5000,"EZW"]
[38490303,7,384900301,67,null,29.718038816021384,28.2,37.9,40.9,42.4,36.6,38.4,40.299999999999997,41.2,42.8,46.8,48.4,47.3,46.1,40.5,42.4,45.1,48,52.3,55.5,58.1,46,46,52,5.0000000000000001E-3,1200,6.8,0,-10.399999999999999,400,442.45305500397774,1.953125E-3,3.90625E-3,7.8125E-3,1.5625E-2,3.125E-2,6.25E-2,0.125,0.25,0.5,1,1,0.5,0.25,0.125,6.25E-2,3.125E-2,1.5625E-2,7.8125E-3,3.90625E-3,1.953125E-3,9.765625E-4,2.5110670053836728,-9.9999999999997868E-2,-1.7999999999999972,-2.6999999999999957,-1.6000000000000014,-1,-2.5,-5.0999999999999943,-8.1000000000000014,-10.399999999999999,-7.1999999999999957,1.8999999999999986,8.6000000000000014,12.699999999999996,13.5,13.200000000000003,12.799999999999997,12.5,12.299999999999997,15.299999999999997,13.524919635035083,0]
[38490304,8,384900301,67,null,29.718038816021384,28.2,37.9,40.9,42.4,36.6,38.4,40.299999999999997,41.2,42.8,46.8,48.4,47.3,46.1,40.5,42.4,45.1,48,52.3,55.5,58.1,46,46,52,5.0000000000000001E-3,1200,6.8,6,-9.7999999999999972,400,442.45305500397774,1.953125E-3,3.90625E-3,7.8125E-3,1.5625E-2,3.125E-2,6.25E-2,0.125,0.25,0.5,1,1,0.5,0.25,0.125,6.25E-2,3.125E-2,1.5625E-2,7.8125E-3,3.90625E-3,1.953125E-3,9.765625E-4,2.6017548203264127,-9.9999999999997868E-2,-1.5,-2.8999999999999986,0.30000000000000426,0.39999999999999858,-3.1999999999999957,-4.8999999999999986,-7.3000000000000043,-9.7999999999999972,-7.1999999999999957,1,7.4000000000000057,10.5,13.399999999999999,13.399999999999999,13.399999999999999,13.399999999999999,13.799999999999997,16.087007176964406,15.532499294703221,0]
[38490306,10,384900301,67,null,29.718038816021384,28.2,37.9,40.9,42.4,36.6,38.4,40.299999999999997,41.2,42.8,46.8,48.4,47.3,46.1,40.5,42.4,45.1,48,52.3,55.5,58.1,46,46,52,5.0000000000000001E-3,1200,6.8,6,-9.5,400,442.45305500397774,1.953125E-3,3.90625E-3,7.8125E-3,1.5625E-2,3.125E-2,6.25E-2,0.125,0.25,0.5,1,1,0.5,0.25,0.125,6.25E-2,3.125E-2,1.5625E-2,7.8125E-3,3.90625E-3,1.953125E-3,9.765625E-4,1.864985853082807,-9.9999999999997868E-2,-1.6999999999999957,-3.6999999999999957,-0.19999999999999574,0.29999999999999716,-2.6000000000000014,-5.1999999999999957,-7.3000000000000043,-9.5,-6.7999999999999972,1.8000000000000043,8.5,8.1000000000000014,11.100000000000001,13.5,13.199999999999996,13,12.700000000000003,13.599999999999994,13.487997585242248,0]
[38490307,11,384900301,67,null,29.718038816021384,28.2,37.9,40.9,42.4,36.6,38.4,40.299999999999997,41.2,42.8,46.8,48.4,47.3,46.1,40.5,42.4,45.1,48,52.3,55.5,58.1,46,46,52,5.0000000000000001E-3,1200,6.8,6,-9.5,400,442.45305500397774,1.953125E-3,3.90625E-3,7.8125E-3,1.5625E-2,3.125E-2,6.25E-2,0.125,0.25,0.5,1,1,0.5,0.25,0.125,6.25E-2,3.125E-2,1.5625E-2,7.8125E-3,3.90625E-3,1.953125E-3,9.765625E-4,2.6906521930697735,-0.69999999999999929,-2,-3.5,-0.5,0.29999999999999716,-2.7999999999999972,-5.1999999999999957,-7.3000000000000043,-9.5,-6.6999999999999957,1.3000000000000043,8.2000000000000028,12,14.399999999999999,14,14,14,14.700000000000003,17.375296657273253,16.837334240394647,0]
[38490308,12,384900301,67,null,29.718038816021384,28.2,37.9,40.9,42.4,36.6,38.4,40.299999999999997,41.2,42.8,46.8,48.4,47.3,46.1,40.5,42.4,45.1,48,52.3,55.5,58.1,46,46,52,5.0000000000000001E-3,1200,6.8,6,-9.8999999999999986,400,442.45305500397774,1.953125E-3,3.90625E-3,7.8125E-3,1.5625E-2,3.125E-2,6.25E-2,0.125,0.25,0.5,1,1,0.5,0.25,0.125,6.25E-2,3.125E-2,1.5625E-2,7.8125E-3,3.90625E-3,1.953125E-3,9.765625E-4,2.1378822846820604,-0.89999999999999858,-1.3999999999999986,-2.6999999999999957,-0.69999999999999574,-0.20000000000000284,-3.2999999999999972,-5.3999999999999986,-7.1000000000000014,-9.8999999999999986,-7.2999999999999972,0.60000000000000142,6.6000000000000014,10.5,13.700000000000003,13.600000000000001,13.699999999999996,13.899999999999999,14.5,17.009885512608179,15.377189657511316,0]
[38490309,13,384900301,67,null,29.718038816021384,28.2,37.9,40.9,42.4,36.6,38.4,40.299999999999997,41.2,42.8,46.8,48.4,47.3,46.1,40.5,42.4,45.1,48,52.3,55.5,58.1,46,46,52,5.0000000000000001E-3,1200,6.8,10,-9.0999999999999943,400,442.45305500397774,1.953125E-3,3.90625E-3,7.8125E-3,1.5625E-2,3.125E-2,6.25E-2,0.125,0.25,0.5,1,1,0.5,0.25,0.125,6.25E-2,3.125E-2,1.5625E-2,7.8125E-3,3.90625E-3,1.953125E-3,9.765625E-4,3.2162132753105936,1.8000000000000007,-3.2999999999999972,-5.5,-1.3999999999999986,1.5,-2.5,-4.3999999999999986,-6.8000000000000043,-9.0999999999999943,-7.3999999999999986,0,6.1000000000000014,11.100000000000001,14.5,14.600000000000001,9.2999999999999972,12.399999999999999,14.299999999999997,13.5,13.618318559684489,0]
[38490310,14,384900301,67,null,29.718038816021384,28.2,37.9,40.9,42.4,36.6,38.4,40.299999999999997,41.2,42.8,46.8,48.4,47.3,46.1,40.5,42.4,45.1,48,52.3,55.5,58.1,46,46,52,5.0000000000000001E-3,1200,6.8,10,-9.2999999999999972,400,442.45305500397774,1.953125E-3,3.90625E-3,7.8125E-3,1.5625E-2,3.125E-2,6.25E-2,0.125,0.25,0.5,1,1,0.5,0.25,0.125,6.25E-2,3.125E-2,1.5625E-2,7.8125E-3,3.90625E-3,1.953125E-3,9.765625E-4,1.7311790473404898,0.60000000000000142,-2.1999999999999957,-6.7999999999999972,0.39999999999999858,2.2999999999999972,-2.3999999999999986,-4.0999999999999943,-7,-9.2999999999999972,-7.0999999999999943,0.30000000000000426,6.5,11.5,15.799999999999997,16.200000000000003,16,16.5,17.600000000000009,19.207501309133988,17.310403217268039,0]
[38490311,15,384900301,67,null,29.718038816021384,28.2,37.9,40.9,42.4,36.6,38.4,40.299999999999997,41.2,42.8,46.8,48.4,47.3,46.1,40.5,42.4,45.1,48,52.3,55.5,58.1,46,46,52,5.0000000000000001E-3,1200,6.8,10,-9.7999999999999972,400,442.45305500397774,1.953125E-3,3.90625E-3,7.8125E-3,1.5625E-2,3.125E-2,6.25E-2,0.125,0.25,0.5,1,1,0.5,0.25,0.125,6.25E-2,3.125E-2,1.5625E-2,7.8125E-3,3.90625E-3,1.953125E-3,9.765625E-4,2.2601290565935308,0.90000000000000213,-2.2999999999999972,-4.6999999999999957,-1.3999999999999986,1,-3,-4.6999999999999957,-6.8000000000000043,-9.7999999999999972,-8.0999999999999943,-0.19999999999999574,5.3000000000000043,10,15.100000000000001,15.800000000000004,15.600000000000001,16.299999999999997,17.200000000000003,19.015481493354855,17.05926274953061,0]
[38490312,16,384900301,67,null,29.718038816021384,28.2,37.9,40.9,42.4,36.6,38.4,40.299999999999997,41.2,42.8,46.8,48.4,47.3,46.1,40.5,42.4,45.1,48,52.3,55.5,58.1,46,46,52,5.0000000000000001E-3,1200,6.8,12,-9.5999999999999943,400,442.45305500397774,1.953125E-3,3.90625E-3,7.8125E-3,1.5625E-2,3.125E-2,6.25E-2,0.125,0.25,0.5,1,1,0.5,0.25,0.125,6.25E-2,3.125E-2,1.5625E-2,7.8125E-3,3.90625E-3,1.953125E-3,9.765625E-4,2.4533455345022261,0.60000000000000142,-2.7999999999999972,-5.1000000000000014,-1.6000000000000014,1,-2.6000000000000014,-4,-6.7000000000000028,-9.5999999999999943,-8,-0.60000000000000142,5.3000000000000043,9.7999999999999972,14.899999999999999,15.5,15.5,16.099999999999994,17.299999999999997,18.433695028530906,16.519656900535729,0]
[38490313,17,384900301,67,null,29.718038816021384,28.2,37.9,40.9,42.4,36.6,38.4,40.299999999999997,41.2,42.8,46.8,48.4,47.3,46.1,40.5,42.4,45.1,48,52.3,55.5,58.1,46,46,52,5.0000000000000001E-3,1200,6.8,12,-9.8999999999999986,400,442.45305500397774,1.953125E-3,3.90625E-3,7.8125E-3,1.5625E-2,3.125E-2,6.25E-2,0.125,0.25,0.5,1,1,0.5,0.25,0.125,6.25E-2,3.125E-2,1.5625E-2,7.8125E-3,3.90625E-3,1.953125E-3,9.765625E-4,2.3215882324853823,1.3000000000000007,-2,-4.7999999999999972,-1.5,0.89999999999999858,-3,-4.2999999999999972,-6.7000000000000028,-9.8999999999999986,-7.6999999999999957,-0.29999999999999716,5.5,8.8999999999999986,13.100000000000001,15.399999999999999,15.299999999999997,15.799999999999997,16.200000000000003,16.497443690183843,13.786144594561414,0]
[38490314,18,384900301,67,null,29.718038816021384,28.2,37.9,40.9,42.4,36.6,38.4,40.299999999999997,41.2,42.8,46.8,48.4,47.3,46.1,40.5,42.4,45.1,48,52.3,55.5,58.1,46,46,52,5.0000000000000001E-3,1200,6.8,12,-9.7999999999999972,400,442.45305500397774,1.953125E-3,3.90625E-3,7.8125E-3,1.5625E-2,3.125E-2,6.25E-2,0.125,0.25,0.5,1,1,0.5,0.25,0.125,6.25E-2,3.125E-2,1.5625E-2,7.8125E-3,3.90625E-3,1.953125E-3,9.765625E-4,1.8850209008422425,-0.30000000000000071,-2.3999999999999986,-4.2999999999999972,-0.79999999999999716,1.7999999999999972,-2.5,-3.8999999999999986,-6.4000000000000057,-9.7999999999999972,-7.7999999999999972,-0.39999999999999858,5.6000000000000014,10.100000000000001,14.899999999999999,15.5,15.699999999999996,16.299999999999997,17.299999999999997,18.604277999836711,14.061453616618813,0]
[38490315,19,384900301,67,null,29.718038816021384,28.2,37.9,40.9,42.4,36.6,38.4,40.299999999999997,41.2,42.8,46.8,48.4,47.3,46.1,40.5,42.4,45.1,48,52.3,55.5,58.1,46,46,52,5.0000000000000001E-3,1200,6.8,12,-9.6999999999999957,400,442.45305500397774,1.953125E-3,3.90625E-3,7.8125E-3,1.5625E-2,3.125E-2,6.25E-2,0.125,0.25,0.5,1,1,0.5,0.25,0.125,6.25E-2,3.125E-2,1.5625E-2,7.8125E-3,3.90625E-3,1.953125E-3,9.765625E-4,1.2473133584987863,1.1000000000000014,-2.6999999999999957,-3.7999999999999972,-0.79999999999999716,1.1999999999999957,-2.3999999999999986,-3.8999999999999986,-6.3000000000000043,-9.6999999999999957,-8.0999999999999943,-0.39999999999999858,5.1000000000000014,9.8999999999999986,14.799999999999997,15.5,15.600000000000001,16.200000000000003,17.5,18.784688454800531,15.268560677748603,0]
[38490316,20,384900301,67,null,29.718038816021384,28.2,37.9,40.9,42.4,36.6,38.4,40.299999999999997,41.2,42.8,46.8,48.4,47.3,46.1,40.5,42.4,45.1,48,52.3,55.5,58.1,46,46,52,5.0000000000000001E-3,1200,6.8,12,-9.6999999999999957,400,442.45305500397774,1.953125E-3,3.90625E-3,7.8125E-3,1.5625E-2,3.125E-2,6.25E-2,0.125,0.25,0.5,1,1,0.5,0.25,0.125,6.25E-2,3.125E-2,1.5625E-2,7.8125E-3,3.90625E-3,1.953125E-3,9.765625E-4,2.3627557201667528,-9.9999999999997868E-2,-1.5,-2.7999999999999972,-1.6000000000000014,0.29999999999999716,-3.3999999999999986,-4.2999999999999972,-6.7000000000000028,-9.6999999999999957,-8,-0.69999999999999574,5.2000000000000028,9.7999999999999972,14.700000000000003,15.5,15.600000000000001,16.200000000000003,17.299999999999997,18.865928130182368,17.243156393808924,0]
[38490317,21,384900301,67,null,29.718038816021384,28.2,37.9,40.9,42.4,36.6,38.4,40.299999999999997,41.2,42.8,46.8,48.4,47.3,46.1,40.5,42.4,45.1,48,52.3,55.5,58.1,46,49,52,0.01,1200,18.600000000000001,12,-7.5,250,267.52549873445383,7.8125E-3,1.5625E-2,3.125E-2,6.25E-2,0.125,0.25,0.5,1,1,0.5,0.25,0.125,6.25E-2,3.125E-2,1.5625E-2,7.8125E-3,3.90625E-3,1.953125E-3,9.765625E-4,4.8828125E-4,2.44140625E-4,4.0504977762558454,2.1999999999999993,-1.3999999999999986,-5,-2.3999999999999986,0.69999999999999574,-4.3999999999999986,-7.5,-7,-1,2.7000000000000028,8.2000000000000028,11.800000000000004,14.5,18.399999999999999,18.800000000000004,18,16.799999999999997,15.200000000000003,15.044671330949939,16.012997273839069,3]
[38490318,22,384900301,67,null,29.718038816021384,28.2,37.9,40.9,42.4,36.6,38.4,40.299999999999997,41.2,42.8,46.8,48.4,47.3,46.1,40.5,42.4,45.1,48,52.3,55.5,58.1,46,49,52,0.01,1200,18.600000000000001,10,-7.3999999999999986,250,267.52549873445383,7.8125E-3,1.5625E-2,3.125E-2,6.25E-2,0.125,0.25,0.5,1,1,0.5,0.25,0.125,6.25E-2,3.125E-2,1.5625E-2,7.8125E-3,3.90625E-3,1.953125E-3,9.765625E-4,4.8828125E-4,2.44140625E-4,3.9681563574727292,1.3000000000000007,-2,-5.5,-2.6000000000000014,0.60000000000000142,-4.2999999999999972,-7.3999999999999986,-6.4000000000000057,0.10000000000000142,4,9,12.5,15.299999999999997,18.700000000000003,19.399999999999999,18.899999999999999,17.599999999999994,16.5,16.266534765437711,16.727433683037411,3]
[38490319,23,384900301,67,null,29.718038816021384,28.2,37.9,40.9,42.4,36.6,38.4,40.299999999999997,41.2,42.8,46.8,48.4,47.3,46.1,40.5,42.4,45.1,48,52.3,55.5,58.1,46,49,52,0.01,1200,18.600000000000001,10,-7.1999999999999957,250,267.52549873445383,7.8125E-3,1.5625E-2,3.125E-2,6.25E-2,0.125,0.25,0.5,1,1,0.5,0.25,0.125,6.25E-2,3.125E-2,1.5625E-2,7.8125E-3,3.90625E-3,1.953125E-3,9.765625E-4,4.8828125E-4,2.44140625E-4,2.798738565583399,1.1000000000000014,-3.6999999999999957,-8.3999999999999986,-2.6000000000000014,0.5,-4.5,-7.1999999999999957,-6.7000000000000028,0.40000000000000568,3.9000000000000057,8.7000000000000028,12.300000000000004,14.899999999999999,18.5,19.300000000000004,18.699999999999996,17.200000000000003,15.900000000000006,15.96524161935676,15.778135404876444,3]
{"$rows_left_out":31}
{"sheet":"Drop_downs","index":3,"n_rows":4,"n_cols":22,"rows_kept":4,"cut":false,"hidden":true,"merged":[]}
[null,50,63,80,100,125,160,200,250,315,400,500,630,800,1000,1250,1600,2000,2500,3150,4000,5000]
["Grundwand auswählen"]
["SHB Beton",45.9,37.6,39,50.2,47.1,49.7,48.4,52.2,54.8,58.4,58.7,62.8,62.6,64.8,66.2,69.2,70.2,71.2,73.5,77,79.099999999999994]
["SHB Ziegel",29.718038816021384,28.2,37.9,40.9,42.4,36.6,38.4,40.299999999999997,41.2,42.8,46.8,48.4,47.3,46.1,40.5,42.4,45.1,48,52.3,55.5,58.1]